Target
Rap guanine nucleotide exchange factor 3
Ligand
BDBM50011360
Substrate
Meas. Tech.
ChEMBL_1746759 (CHEMBL4181269)
IC50
9100±n/a nM
Citation
 Liu, ZZhu, YChen, HWang, PMei, FCYe, NCheng, XZhou, J Structure-activity relationships of 2-substituted phenyl-N-phenyl-2-oxoacetohydrazonoyl cyanides as novel antagonists of exchange proteins directly activated by cAMP (EPACs). Bioorg Med Chem Lett 27:5163-5166 (2017)  
Target
Name:
Rap guanine nucleotide exchange factor 3
Synonyms:
CGEF1 EPAC 1 Exchange factor directly activated by cAMP 1 RAPGEF3 Rap1 guanine-nucleotide-exchange factor directly activated by cAMP cAMP-regulated guanine nucleotide exchange factor I
Type:
PROTEIN
Mol. Mass.:
103769.52
Organism:
Homo sapiens (Human)
Description:
ChEMBL_104531
Residue:
923
  
Inhibitor
Name:
BDBM50011360
Synonyms:
CHEMBL3260990
Type:
Small organic molecule
Emp. Form.:
C16H15ClN4O2
Mol. Mass.:
330.769
SMILES:
CC(C)(C)c1cc(no1)C(=O)C(=N\Nc1cccc(Cl)c1)\C#N
: