Target
Genome polyprotein
Ligand
BDBM50452542
Substrate
Meas. Tech.
ChEMBL_1747697 (CHEMBL4182207)
EC50
130±n/a nM
Citation
 Bowsher, MHiebert, SLi, RWang, AXFriborg, JYu, FHernandez, DWang, YKKlei, HRajamani, RMosure, KKnipe, JOMeanwell, NAMcPhee, FScola, PM The discovery and optimization of naphthalene-linked P2-P4 Macrocycles as inhibitors of HCV NS3 protease. Bioorg Med Chem Lett 28:43-48 (2018)  
Target
Name:
Genome polyprotein
Synonyms:
Hepatitis C virus NS3 protease/helicase | Hepatitis C virus serine protease, NS3/NS4A
Type:
Protein
Mol. Mass.:
67067.41
Organism:
Hepatitis C virus
Description:
A3EZI9
Residue:
631
  
Inhibitor
Name:
BDBM50452542
Synonyms:
CHEMBL4207303
Type:
Small organic molecule
Emp. Form.:
C42H59N5O10S
Mol. Mass.:
826.01
SMILES:
COc1cc2ccc3cc2cc1OCCCN(CCOC(=O)N[C@H](C(=O)N1C[C@]3(C[C@H]1C(=O)N[C@@]1(C[C@H]1C1CC1)C(=O)NS(=O)(=O)C1CC1)OC)C(C)(C)C)C(C)C
: