Target
cGMP-dependent 3',5'-cyclic phosphodiesterase
Ligand
BDBM38920
Substrate
Meas. Tech.
ChEMBL_1747763 (CHEMBL4182273)
IC50
>10000±n/a nM
Citation
 Qiu, XHuang, YWu, DMao, FZhu, JYan, WLuo, HBLi, J Discovery of novel purine nucleoside derivatives as phosphodiesterase 2 (PDE2) inhibitors: Structure-based virtual screening, optimization and biological evaluation. Bioorg Med Chem 26:119-133 (2018)  
Target
Name:
cGMP-dependent 3',5'-cyclic phosphodiesterase
Synonyms:
CGS-PDE Homo sapiens phosphodiesterase 2A (PDE2A) PDE2A cGSPDE
Type:
Enzyme Catalytic Domain
Mol. Mass.:
105691.58
Organism:
Homo sapiens (Human)
Description:
O00408
Residue:
941
  
Inhibitor
Name:
BDBM38920
Synonyms:
2-CHLORO-2'-DEOXYADENOSINE MLS000028377 cid_20279
Type:
Small organic molecule
Emp. Form.:
C10H12ClN5O3
Mol. Mass.:
285.687
SMILES:
Nc1nc(Cl)nc2n(cnc12)[C@H]1C[C@H](O)[C@@H](CO)O1
: