Target
D(2) dopamine receptor
Ligand
BDBM50019909
Substrate
Meas. Tech.
ChEBML_61441
IC50
>1000±n/a nM
Citation
 Wise, LDButler, DEDeWald, HALustgarten, DMPattison, ICSchweiss, DNCoughenour, LLDowns, DAHeffner, TGPugsley, TA 1,3-Dialkyl-4-(iminoarylmethyl)-1H-pyrazol-5-ols. A series of novel potential antipsychotic agents. J Med Chem 30:1807-12 (1987)  
Target
Name:
D(2) dopamine receptor
Synonyms:
DOPAMINE D2 DOPAMINE D2 Short Dopamine D2 receptor Drd2
Type:
G Protein-Coupled Receptor (GPCR)
Mol. Mass.:
50931.60
Organism:
Rattus norvegicus (rat)
Description:
P61169
Residue:
444
  
Inhibitor
Name:
BDBM50019909
Synonyms:
CHEMBL3144632 | N-[(3-Chloro-phenyl)-(5-hydroxy-1,3-dimethyl-1H-pyrazol-4-yl)-methylene]-acetamide
Type:
Small organic molecule
Emp. Form.:
C14H14ClN3O2
Mol. Mass.:
291.733
SMILES:
CC(=O)\N=C(\c1c(C)[nH]n(C)c1=O)c1cccc(Cl)c1
: