Target
D(2) dopamine receptor
Ligand
BDBM50019920
Substrate
Meas. Tech.
ChEBML_61441
IC50
>10000±n/a nM
Citation
 Wise, LDButler, DEDeWald, HALustgarten, DMPattison, ICSchweiss, DNCoughenour, LLDowns, DAHeffner, TGPugsley, TA 1,3-Dialkyl-4-(iminoarylmethyl)-1H-pyrazol-5-ols. A series of novel potential antipsychotic agents. J Med Chem 30:1807-12 (1987)  
Target
Name:
D(2) dopamine receptor
Synonyms:
DOPAMINE D2 DOPAMINE D2 Short Dopamine D2 receptor Drd2
Type:
G Protein-Coupled Receptor (GPCR)
Mol. Mass.:
50931.60
Organism:
Rattus norvegicus (rat)
Description:
P61169
Residue:
444
  
Inhibitor
Name:
BDBM50019920
Synonyms:
4-[(3-Fluoro-phenyl)-imino-methyl]-2,5-dimethyl-2H-pyrazol-3-ol | CHEMBL3144629
Type:
Small organic molecule
Emp. Form.:
C12H12FN3O
Mol. Mass.:
233.2416
SMILES:
Cc1[nH]n(C)c(=O)c1C(=N)c1cccc(F)c1
: