Target
Probable maltase-glucoamylase 2
Ligand
BDBM50454318
Substrate
Meas. Tech.
ChEMBL_1752597 (CHEMBL4187357)
Ki
13000±n/a nM
Citation
 Li, ZPSong, YHUddin, ZWang, YPark, KH Inhibition of protein tyrosine phosphatase 1B (PTP1B) and ?-glucosidase by xanthones from Cratoxylum cochinchinense, and their kinetic characterization. Bioorg Med Chem 26:737-746 (2018)  
Target
Name:
Probable maltase-glucoamylase 2
Synonyms:
3.2.1.3 Glucoamylase MGAM2 Probable maltase-glucoamylase 2
Type:
PROTEIN
Mol. Mass.:
277932.17
Organism:
Homo sapiens
Description:
ChEMBL_116927
Residue:
2515
  
Inhibitor
Name:
BDBM50454318
Synonyms:
CHEMBL4202640
Type:
Small organic molecule
Emp. Form.:
C23H24O6
Mol. Mass.:
396.4331
SMILES:
C\C(CCC(O)C(C)=C)=C/COc1ccc2oc3cc(O)cc(O)c3c(=O)c2c1
: