Target
TGF-beta receptor type-1
Ligand
BDBM412734
Substrate
Meas. Tech.
ChEMBL_1753651 (CHEMBL4188411)
Ki
0.140000±n/a nM
Citation
 Harikrishnan, LSWarrier, JTebben, AJTonukunuru, GMadduri, SRBaligar, VMannoori, RSeshadri, BRahaman, HArunachalam, PNDikundwar, AGFink, BEFargnoli, JFereshteh, MFan, YLippy, JHo, CPWautlet, BSheriff, SRuzanov, MBorzilleri, RM Heterobicyclic inhibitors of transforming growth factor beta receptor I (TGF?RI). Bioorg Med Chem 26:1026-1034 (2018)  
Target
Name:
TGF-beta receptor type-1
Synonyms:
ALK-5 Activin A receptor type II-like protein kinase of 53kD SKR4 TGF-beta receptor type I TGFBR1 TGFR1_HUMAN Transforming growth factor-beta receptor type I
Type:
enzyme
Mol. Mass.:
55968.24
Organism:
Homo sapiens (Human)
Description:
P36897
Residue:
503
  
Inhibitor
Name:
BDBM412734
Synonyms:
N-(3-fluoropyridin-4-yl)-2-(6-methylpyridin-2-yl)-7H-pyrrolo[2,3-d]pyrimidin-4-amine | US10399987, Example 1
Type:
Small organic molecule
Emp. Form.:
C17H13FN6
Mol. Mass.:
320.3237
SMILES:
Cc1cccc(n1)-c1nc(Nc2ccncc2F)c2cc[nH]c2n1
: