Target
Gamma-aminobutyric acid receptor subunit gamma-1
Ligand
BDBM50021186
Substrate
Meas. Tech.
ChEBML_68602
IC50
400±n/a nM
Citation
 Krogsgaard-Larsen, PNielsen, LFalch, ECurtis, DR GABA agonists. Resolution, absolute stereochemistry, and enantioselectivity of (S)-(+)- and (R)-(-)-dihydromuscimol. J Med Chem 28:1612-7 (1985)  
Target
Name:
Gamma-aminobutyric acid receptor subunit gamma-1
Synonyms:
Benzodiazepine receptors GABA receptor gamma-1 subunit Gabrg1
Type:
PROTEIN
Mol. Mass.:
53557.84
Organism:
Rattus norvegicus
Description:
ChEMBL_193817
Residue:
465
  
Inhibitor
Name:
BDBM50021186
Synonyms:
4-Amino-3-hydroxy-butyric acid S(+)-4-amino-3-hydroxybutanoic acid
Type:
Small organic molecule
Emp. Form.:
C4H9NO3
Mol. Mass.:
119.1192
SMILES:
NC[C@@H](O)CC(O)=O
: