Target
5-hydroxytryptamine receptor 2B
Ligand
BDBM50335601
Substrate
Meas. Tech.
ChEMBL_1757992 (CHEMBL4193000)
Ki
4700±n/a nM
Citation
 Lin, ZSmith, MDConcepcion, GPHaygood, MGOlivera, BMLight, ASchmidt, EW Modulating the Serotonin Receptor Spectrum of Pulicatin Natural Products. J Nat Prod 80:2360-2370 (2017)  
Target
Name:
5-hydroxytryptamine receptor 2B
Synonyms:
5-HT-2B 5-hydroxytryptamine (serotonin) receptor 2B [Homo sapiens] 5-hydroxytryptamine receptor 2C (5HT2C) HTR2B Serotonin 2b (5-HT2b) receptor | Serotonin Receptor 2B
Type:
G Protein-Coupled Receptor (GPCR)
Mol. Mass.:
54312.47
Organism:
Homo sapiens (Human)
Description:
Receptor binding assays were performed using human clone stably expressed in CHO cells.
Residue:
481
  
Inhibitor
Name:
BDBM50335601
Synonyms:
CHEMBL1651093 | Watasemycins A
Type:
Small organic molecule
Emp. Form.:
C16H20N2O3S2
Mol. Mass.:
352.472
SMILES:
C[C@@H]1SC(=N[C@H]1[C@@H]1SC[C@@](C)(N1C)C(O)=O)c1ccccc1O
: