Target
5-hydroxytryptamine receptor 1E
Ligand
BDBM50335602
Substrate
Meas. Tech.
ChEMBL_1757994 (CHEMBL4193002)
Ki
>10000±n/a nM
Citation
 Lin, ZSmith, MDConcepcion, GPHaygood, MGOlivera, BMLight, ASchmidt, EW Modulating the Serotonin Receptor Spectrum of Pulicatin Natural Products. J Nat Prod 80:2360-2370 (2017)  
Target
Name:
5-hydroxytryptamine receptor 1E
Synonyms:
5-HT-1E 5-Hydroxytryptamine Receptor Subtype 1E (5HT1E) 5-hydroxytryptamine receptor 1E (5-HT-1E) (S31) 5HT1E_HUMAN S31 Serotonin 1e (5-HT1e) receptor | Serotonin Receptor 1E
Type:
G Protein-Coupled Receptor (GPCR)
Mol. Mass.:
41697.80
Organism:
Homo sapiens (Human)
Description:
gi_112822
Residue:
365
  
Inhibitor
Name:
BDBM50335602
Synonyms:
CHEMBL1651094 | Watasemycins B
Type:
Small organic molecule
Emp. Form.:
C16H20N2O3S2
Mol. Mass.:
352.472
SMILES:
C[C@@H]1SC(=N[C@H]1[C@H]1SC[C@@](C)(N1C)C(O)=O)c1ccccc1O
: