Target
5-hydroxytryptamine receptor 5A
Ligand
BDBM50335602
Substrate
Meas. Tech.
ChEMBL_1757998 (CHEMBL4193006)
Ki
>10000±n/a nM
Citation
 Lin, ZSmith, MDConcepcion, GPHaygood, MGOlivera, BMLight, ASchmidt, EW Modulating the Serotonin Receptor Spectrum of Pulicatin Natural Products. J Nat Prod 80:2360-2370 (2017)  
Target
Name:
5-hydroxytryptamine receptor 5A
Synonyms:
5-HT-5 5-hydroxytryptamine receptor 5 (5-HT5) 5HT5A_HUMAN Serotonin (5-HT) receptor | Serotonin receptor 5A
Type:
Enzyme
Mol. Mass.:
40266.25
Organism:
Homo sapiens (Human)
Description:
P47898
Residue:
357
  
Inhibitor
Name:
BDBM50335602
Synonyms:
CHEMBL1651094 | Watasemycins B
Type:
Small organic molecule
Emp. Form.:
C16H20N2O3S2
Mol. Mass.:
352.472
SMILES:
C[C@@H]1SC(=N[C@H]1[C@H]1SC[C@@](C)(N1C)C(O)=O)c1ccccc1O
: