Target
Gamma-aminobutyric acid receptor subunit alpha-4/beta-3/delta
Ligand
BDBM50457445
Substrate
Meas. Tech.
ChEMBL_1759685 (CHEMBL4194693)
EC50
970±n/a nM
Citation
 Yakoub, KJung, SSattler, CDamerow, HWeber, JKretzschmann, ACankaya, ASPiel, MRösch, FHaugaard, ASFrølund, BSchirmeister, TLüddens, H Structure-Function Evaluation of Imidazopyridine Derivatives Selective for ?-Subunit-Containing ?-Aminobutyric Acid Type A (GABA J Med Chem 61:1951-1968 (2018)  
Target
Name:
Gamma-aminobutyric acid receptor subunit alpha-4/beta-3/delta
Synonyms:
Type:
Mol. Mass.:
Description:
ASSAY_ID of ChEMBL is 1759685
Components:
This complex has 3 components.
Component 1
Name:
Gamma-aminobutyric acid receptor subunit delta
Synonyms:
GABA(A) receptor subunit delta Gabrd
Type:
Enzyme
Mol. Mass.:
50571.23
Organism:
Rattus norvegicus (Rat)
Description:
P18506
Residue:
449
  
Component 2
Name:
Gamma-aminobutyric acid receptor subunit alpha-4
Synonyms:
GBRA4_RAT Gamma-aminobutyric acid receptor (GABA(A)) subunit alpha-4
Type:
Enzyme
Mol. Mass.:
60972.37
Organism:
Rattus norvegicus (Rat)
Description:
P28471
Residue:
552
  
Component 3
Name:
Gamma-aminobutyric acid receptor subunit beta-3
Synonyms:
GABA receptor beta-3 subunit Gabrb-3 | Gabrb3
Type:
PROTEIN
Mol. Mass.:
54180.66
Organism:
Rattus norvegicus
Description:
EBI_12481
Residue:
473
  
Inhibitor
Name:
BDBM50457445
Synonyms:
CHEMBL4212818
Type:
Small organic molecule
Emp. Form.:
C18H12ClN3OS
Mol. Mass.:
353.825
SMILES:
Clc1ccc(cc1)C(=O)Nc1c(nc2ccccn12)-c1cccs1
: