Target
Mitogen-activated protein kinase kinase kinase 14
Ligand
BDBM312809
Substrate
Meas. Tech.
ChEMBL_1760740 (CHEMBL4195748)
Ki
0.050000±n/a nM
Citation
 Blaquiere, NCastanedo, GMBurch, JDBerezhkovskiy, LMBrightbill, HBrown, SChan, CChiang, PCCrawford, JJDong, TFan, PFeng, JGhilardi, NGodemann, RGogol, EGrabbe, AHole, AJHu, BHymowitz, SGAlaoui Ismaili, MHLe, HLee, PLee, WLin, XLiu, NMcEwan, PAMcKenzie, BSilvestre, HLSuto, ESujatha-Bhaskar, SWu, GWu, LCZhang, YZhong, ZStaben, ST Scaffold-Hopping Approach To Discover Potent, Selective, and Efficacious Inhibitors of NF-?B Inducing Kinase. J Med Chem 61:6801-6813 (2018)  
Target
Name:
Mitogen-activated protein kinase kinase kinase 14
Synonyms:
HsNIK MAP3K14 NF-kappa-beta-inducing kinase (NF-kB) Serine/threonine-protein kinase NIK
Type:
Protein
Mol. Mass.:
104059.50
Organism:
Homo sapiens (Human)
Description:
Q99558
Residue:
947
  
Inhibitor
Name:
BDBM312809
Synonyms:
1-[3-[2-[(3R)-3-hydroxy-1- methyl-2-oxo-pyrrolidin-3- yl]ethynyl]phenyl]-6-methoxy- imidazo[1,5-a]pyridine- 3-carboxamide | US9605005, Example 98
Type:
Small organic molecule
Emp. Form.:
C22H20N4O4
Mol. Mass.:
404.4186
SMILES:
COc1ccc2c(nc(C(N)=O)n2c1)-c1cccc(c1)C#C[C@]1(O)CCN(C)C1=O
: