Target
Cytochrome P450 3A4
Ligand
BDBM50034220
Substrate
Meas. Tech.
ChEMBL_1761167 (CHEMBL4196414)
IC50
>100000±n/a nM
Citation
 Linciano, PMoraes, CBAlcantara, LMFranco, CHPascoalino, BFreitas-Junior, LHMacedo, SSantarem, NCordeiro-da-Silva, AGul, SWitt, GKuzikov, MEllinger, BFerrari, SLuciani, RQuotadamo, ACostantino, LCosti, MP Aryl thiosemicarbazones for the treatment of trypanosomatidic infections. Eur J Med Chem 146:423-434 (2018)  
Target
Name:
Cytochrome P450 3A4
Synonyms:
Albendazole monooxygenase CP3A4_HUMAN CYP3A4 CYPIIIA4 Cytochrome P450 3A4 (CYP3A4) Nifedipine oxidase Taurochenodeoxycholate 6-alpha-hydroxylase
Type:
Enzyme
Mol. Mass.:
57349.57
Organism:
Homo sapiens (Human)
Description:
Residue:
503
  
Inhibitor
Name:
BDBM50034220
Synonyms:
2-(((Hexadecyloxy)hydroxyphosphinyl)oxy)-N,N,N-trimethylethanaminium hydroxide MILTEFOSINE hexadecyl 2-(trimethyl-lambda~5~-azanyl)ethyl hydrogen phosphate hexadecyloxy-2-trimethylammonioethylphosphorate hexadecylphosphocholine, miltefosine | n-hexadecylphosphocholine
Type:
Small organic molecule
Emp. Form.:
C21H46NO4P
Mol. Mass.:
407.568
SMILES:
CCCCCCCCCCCCCCCCOP([O-])(=O)OCC[N+](C)(C)C
: