Target
Cytochrome P450 1A2
Ligand
BDBM50034220
Substrate
Meas. Tech.
ChEMBL_1761163 (CHEMBL4196410)
IC50
>100000±n/a nM
Citation
 Linciano, PMoraes, CBAlcantara, LMFranco, CHPascoalino, BFreitas-Junior, LHMacedo, SSantarem, NCordeiro-da-Silva, AGul, SWitt, GKuzikov, MEllinger, BFerrari, SLuciani, RQuotadamo, ACostantino, LCosti, MP Aryl thiosemicarbazones for the treatment of trypanosomatidic infections. Eur J Med Chem 146:423-434 (2018)  
Target
Name:
Cytochrome P450 1A2
Synonyms:
CP1A2_HUMAN CYPIA2 Cytochrome P(3)450 Cytochrome P450 1A2 (CYP1A2) Cytochrome P450-P3
Type:
Enzyme
Mol. Mass.:
58423.38
Organism:
Homo sapiens (Human)
Description:
P05177
Residue:
516
  
Inhibitor
Name:
BDBM50034220
Synonyms:
2-(((Hexadecyloxy)hydroxyphosphinyl)oxy)-N,N,N-trimethylethanaminium hydroxide MILTEFOSINE hexadecyl 2-(trimethyl-lambda~5~-azanyl)ethyl hydrogen phosphate hexadecyloxy-2-trimethylammonioethylphosphorate hexadecylphosphocholine, miltefosine | n-hexadecylphosphocholine
Type:
Small organic molecule
Emp. Form.:
C21H46NO4P
Mol. Mass.:
407.568
SMILES:
CCCCCCCCCCCCCCCCOP([O-])(=O)OCC[N+](C)(C)C
: