Target
Renin
Ligand
BDBM50016033
Substrate
Meas. Tech.
ChEMBL_195765 (CHEMBL878549)
IC50
25±n/a nM
Citation
 Bock, MGDiPardo, RMEvans, BEFreidinger, RMRittle, KEPayne, LSBoger, JWhitter, WLLaMont, BIUlm, EH Renin inhibitors containing hydrophilic groups. Tetrapeptides with enhanced aqueous solubility and nanomolar potency. J Med Chem 31:1918-23 (1988)  
Target
Name:
Renin
Synonyms:
Angiotensinogenase RENI_HUMAN
Type:
Enzyme
Mol. Mass.:
45058.99
Organism:
Homo sapiens (Human)
Description:
Residue:
406
  
Inhibitor
Name:
BDBM50016033
Synonyms:
CHEMBL3085574 | {1-[1-{1-[2-(1-Benzylcarbamoyl-3-methyl-butylcarbamoyl)-1-hydroxy-ethyl]-3-methyl-butylcarbamoyl}-2-(1H-imidazol-4-yl)-ethylcarbamoyl]-2-phenyl-ethyl}-carbamic acid tert-butyl ester
Type:
Small organic molecule
Emp. Form.:
C41H59N7O7
Mol. Mass.:
761.9499
SMILES:
CC(C)C[C@H](NC(=O)[C@H](Cc1c[nH]cn1)NC(=O)[C@H](Cc1ccccc1)NC(=O)OC(C)(C)C)[C@@H](O)CC(=O)N[C@@H](CC(C)C)C(=O)NCc1ccccc1
: