Target
Aldo-keto reductase family 1 member B1
Ligand
BDBM50022260
Substrate
Meas. Tech.
ChEBML_31911
IC50
770±n/a nM
Citation
 Cerelli, MJCurtis, DLDunn, JPNelson, PHPeak, TMWaterbury, LD Antiinflammatory and aldose reductase inhibitory activity of some tricyclic arylacetic acids. J Med Chem 29:2347-51 (1986)  
Target
Name:
Aldo-keto reductase family 1 member B1
Synonyms:
AKR1B1 ALDR_HUMAN AR Aldose Reductase (ALR2) Aldose reductase (AR)
Type:
Protein
Mol. Mass.:
35855.50
Organism:
Homo sapiens (Human)
Description:
P15121. 4LAU; 2IKI; 4LB4; 2FZD; 2FZ8; 1US0
Residue:
316
  
Inhibitor
Name:
BDBM50022260
Synonyms:
11,12-Dihydro-3H-1-oxa-benzo[4,5]cyclohepta[1,2-e]indene-2,6-dione | CHEMBL311679
Type:
Small organic molecule
Emp. Form.:
C17H12O3
Mol. Mass.:
264.2754
SMILES:
O=C1Cc2ccc3c(CCc4ccccc4C3=O)c2O1
: