Target
Aldo-keto reductase family 1 member B1
Ligand
BDBM50022265
Substrate
Meas. Tech.
ChEBML_31911
IC50
330±n/a nM
Citation
 Cerelli, MJCurtis, DLDunn, JPNelson, PHPeak, TMWaterbury, LD Antiinflammatory and aldose reductase inhibitory activity of some tricyclic arylacetic acids. J Med Chem 29:2347-51 (1986)  
Target
Name:
Aldo-keto reductase family 1 member B1
Synonyms:
AKR1B1 ALDR_HUMAN AR Aldose Reductase (ALR2) Aldose reductase (AR)
Type:
Protein
Mol. Mass.:
35855.50
Organism:
Homo sapiens (Human)
Description:
P15121. 4LAU; 2IKI; 4LB4; 2FZD; 2FZ8; 1US0
Residue:
316
  
Inhibitor
Name:
BDBM50022265
Synonyms:
(11-Oxo-6,11-dihydro-dibenzo[b,e]oxepin-3-yl)-acetic acid Oxepinac
Type:
Small organic molecule
Emp. Form.:
C16H12O4
Mol. Mass.:
268.2641
SMILES:
OC(=O)Cc1ccc2c(OCc3ccccc3C2=O)c1
: