Target
Rhizopuspepsin
Ligand
BDBM50017789
Substrate
Meas. Tech.
ChEBML_222282
Ki
42±n/a nM
Citation
 Salituro, FGAgarwal, NHofmann, TRich, DH Inhibition of aspartic proteinases by peptides containing lysine and ornithine side-chain analogues of statine. J Med Chem 30:286-95 (1987)  
Target
Name:
Rhizopuspepsin
Synonyms:
CARP_RHICH | Rhizopuspepsin
Type:
PROTEIN
Mol. Mass.:
41326.43
Organism:
Rhizopus microsporus var. chinensis
Description:
ChEMBL_100244
Residue:
393
  
Inhibitor
Name:
BDBM50017789
Synonyms:
(3S,4S)-3-Hydroxy-6-methyl-4-{3-methyl-2-[3-methyl-2-(3-methyl-butyrylamino)-butyrylamino]-butyrylamino}-heptanoic acid ethyl ester 3-Hydroxy-6-methyl-4-{3-methyl-2-[3-methyl-2-(3-methyl-butyrylamino)-butyrylamino]-butyrylamino}-heptanoic acid ethyl ester | CHEMBL433050
Type:
Small organic molecule
Emp. Form.:
C25H47N3O6
Mol. Mass.:
485.6572
SMILES:
CCOC(=O)C[C@H](O)[C@H](CC(C)C)NC(=O)[C@@H](NC(=O)[C@@H](NC(=O)CC(C)C)C(C)C)C(C)C
: