Target
Cathepsin D
Ligand
BDBM50022521
Substrate
Meas. Tech.
ChEBML_44976
pH
3.2±n/a
IC50
>1±n/a nM
Comments
extracted
Citation
 Maibaum, JRich, DH Inhibition of porcine pepsin by two substrate analogues containing statine. The effect of histidine at the P2 subsite on the inhibition of aspartic proteinases. J Med Chem 31:625-9 (1988)  
Target
Name:
Cathepsin D
Synonyms:
CATD_BOVIN | CTSD
Type:
PROTEIN
Mol. Mass.:
42158.92
Organism:
Bos taurus
Description:
ChEMBL_1458606
Residue:
387
  
Inhibitor
Name:
BDBM50022521
Synonyms:
Boc-Phe-His-Cha-CH2-S-Leu-NHCO(CH2)2C6H5 | CHEMBL347171
Type:
Small organic molecule
Emp. Form.:
C44H64N6O6S
Mol. Mass.:
805.081
SMILES:
CC(C)CC(NC(=O)CCc1ccccc1)SCC(O)C(CC1CCCCC1)NC(=O)[C@H](Cc1cnc[nH]1)NC(=O)[C@H](Cc1ccccc1)NC(=O)OC(C)(C)C
: