Target
Renin
Ligand
BDBM50022626
Substrate
Meas. Tech.
ChEMBL_195782 (CHEMBL801705)
IC50
350.0±n/a nM
Citation
 Luly, JRBaMaung, NSoderquist, JFung, AKStein, HKleinert, HDMarcotte, PAEgan, DABopp, BMerits, I Renin inhibitors. Dipeptide analogues of angiotensinogen utilizing a dihydroxyethylene transition-state mimic at the scissile bond to impart greater inhibitory potency. J Med Chem 31:2264-76 (1989)  
Target
Name:
Renin
Synonyms:
Angiotensinogenase RENI_HUMAN
Type:
Enzyme
Mol. Mass.:
45058.99
Organism:
Homo sapiens (Human)
Description:
Residue:
406
  
Inhibitor
Name:
BDBM50022626
Synonyms:
CHEMBL3142287 | {1-[1-(1-Cyclohexylmethyl-2,3-dihydroxy-propylcarbamoyl)-ethylcarbamoyl]-2-phenyl-ethyl}-carbamic acid tert-butyl ester
Type:
Small organic molecule
Emp. Form.:
C27H43N3O6
Mol. Mass.:
505.6468
SMILES:
C[C@H](NC(=O)[C@H](Cc1ccccc1)NC(=O)OC(C)(C)C)C(=O)N[C@@H](CC1CCCCC1)[C@@H](O)CO
: