Target
Renin
Ligand
BDBM50022637
Substrate
Meas. Tech.
ChEBML_195784
IC50
0.750000±n/a nM
Citation
 Luly, JRBaMaung, NSoderquist, JFung, AKStein, HKleinert, HDMarcotte, PAEgan, DABopp, BMerits, I Renin inhibitors. Dipeptide analogues of angiotensinogen utilizing a dihydroxyethylene transition-state mimic at the scissile bond to impart greater inhibitory potency. J Med Chem 31:2264-76 (1989)  
Target
Name:
Renin
Synonyms:
Angiotensinogenase RENI_HUMAN
Type:
Enzyme
Mol. Mass.:
45058.99
Organism:
Homo sapiens (Human)
Description:
Residue:
406
  
Inhibitor
Name:
BDBM50022637
Synonyms:
2-(2-Acetylamino-3-phenyl-propionylamino)-N-(1-cyclohexylmethyl-2,3-dihydroxy-5-methyl-hexyl)-3-(4H-imidazol-4-yl)-propionamide | CHEMBL3348553
Type:
Small organic molecule
Emp. Form.:
C31H47N5O5
Mol. Mass.:
569.7354
SMILES:
CC(C)C[C@H](O)[C@H](O)[C@H](CC1CCCCC1)NC(=O)[C@H](Cc1c[nH]cn1)NC(=O)[C@H](Cc1ccccc1)NC(C)=O
: