Target
Tissue-type plasminogen activator
Ligand
BDBM81818
Substrate
Meas. Tech.
ChEMBL_1765365 (CHEMBL4200612)
IC50
>10000±n/a nM
Citation
 Buckley, BJAboelela, AMinaei, EJiang, LXXu, ZAli, UFildes, KCheung, CYCook, SMJohnson, DCBachovchin, DACook, GMApte, MHuang, MRanson, MKelso, MJ 6-Substituted Hexamethylene Amiloride (HMA) Derivatives as Potent and Selective Inhibitors of the Human Urokinase Plasminogen Activator for Use in Cancer. J Med Chem 61:8299-8320 (2018)  
Target
Name:
Tissue-type plasminogen activator
Synonyms:
Alteplase Reteplase Thrombin receptor protein Tissue-type plasminogen activator (tPA) t-PA t-plasminogen activator
Type:
Enzyme
Mol. Mass.:
62931.08
Organism:
Homo sapiens (Human)
Description:
Residue:
562
  
Inhibitor
Name:
BDBM81818
Synonyms:
CAS_1794 HMA | NSC_1794
Type:
Small organic molecule
Emp. Form.:
C12H18ClN7O
Mol. Mass.:
311.771
SMILES:
NC(=N)NC(=O)c1nc(Cl)c(nc1N)N1CCCCCC1
: