Target
Alpha-crystallin B chain
Ligand
BDBM50459235
Substrate
Meas. Tech.
ChEMBL_1765923 (CHEMBL4201170)
EC50
64±n/a nM
Citation
 Yang, XChen, XJYang, ZXi, YBWang, LWu, YYan, YBRao, Y Synthesis, Evaluation, and Structure-Activity Relationship Study of Lanosterol Derivatives To Reverse Mutant-Crystallin-Induced Protein Aggregation. J Med Chem 61:8693-8706 (2018)  
Target
Name:
Alpha-crystallin B chain
Synonyms:
Alpha(B)-crystallin CRYA2 CRYAB_HUMAN Heat shock protein beta-5 Rosenthal fiber component
Type:
PROTEIN
Mol. Mass.:
20162.17
Organism:
Homo sapiens
Description:
ChEMBL_109886
Residue:
175
  
Inhibitor
Name:
BDBM50459235
Synonyms:
CHEMBL4218328
Type:
Small organic molecule
Emp. Form.:
C30H50O2
Mol. Mass.:
442.7168
SMILES:
[H][C@@]1(CC[C@@]2(C)C3=CC[C@@]4([H])C(C)(C)[C@@H](O)CC[C@]4(C)C3=CC[C@]12C)[C@H](C)CCCC(C)(C)O
: