Target
Alpha-crystallin B chain
Ligand
BDBM50459236
Substrate
Meas. Tech.
ChEMBL_1765952 (CHEMBL4201199)
EC50
3116±n/a nM
Citation
 Yang, XChen, XJYang, ZXi, YBWang, LWu, YYan, YBRao, Y Synthesis, Evaluation, and Structure-Activity Relationship Study of Lanosterol Derivatives To Reverse Mutant-Crystallin-Induced Protein Aggregation. J Med Chem 61:8693-8706 (2018)  
Target
Name:
Alpha-crystallin B chain
Synonyms:
Alpha(B)-crystallin CRYA2 CRYAB_HUMAN Heat shock protein beta-5 Rosenthal fiber component
Type:
PROTEIN
Mol. Mass.:
20162.17
Organism:
Homo sapiens
Description:
ChEMBL_109886
Residue:
175
  
Inhibitor
Name:
BDBM50459236
Synonyms:
CHEMBL4203007
Type:
Small organic molecule
Emp. Form.:
C30H52O2
Mol. Mass.:
444.7327
SMILES:
[H][C@@]1(CC[C@@]2(C)C3=C(CC[C@]12C)[C@@]1(C)CC[C@H](O)C(C)(C)[C@]1([H])CC3)[C@H](C)CCCC(C)(C)O
: