Target
Retinal dehydrogenase 2
Ligand
BDBM50459608
Substrate
Meas. Tech.
ChEMBL_1766745 (CHEMBL4201992)
Ki
56±n/a nM
Citation
 Huddle, BCGrimley, EBuchman, CDChtcherbinine, MDebnath, BMehta, PYang, KMorgan, CALi, SFelton, JSun, DMehta, GNeamati, NBuckanovich, RJHurley, TDLarsen, SD Structure-Based Optimization of a Novel Class of Aldehyde Dehydrogenase 1A (ALDH1A) Subfamily-Selective Inhibitors as Potential Adjuncts to Ovarian Cancer Chemotherapy. J Med Chem 61:8754-8773 (2018)  
Target
Name:
Retinal dehydrogenase 2
Synonyms:
AL1A2_HUMAN Aldehyde dehydrogenase family 1 member A2 RALDH(II) Retinal dehydrogenase 2 | Retinaldehyde-specific dehydrogenase type 2
Type:
PROTEIN
Mol. Mass.:
56720.77
Organism:
Homo sapiens (Human)
Description:
ChEMBL_109700
Residue:
518
  
Inhibitor
Name:
BDBM50459608
Synonyms:
CHEBI:90441 | CHEMBL3276621
Type:
Small organic molecule
Emp. Form.:
C12H20Cl4N2O2
Mol. Mass.:
366.111
SMILES:
ClC(Cl)C(=O)NCCCCCCCCNC(=O)C(Cl)Cl
: