Target
Renin
Ligand
BDBM50022875
Substrate
Meas. Tech.
ChEBML_195945
pH
6±n/a
IC50
55000±n/a nM
Comments
extracted
Citation
 Luly, JRBolis, GBaMaung, NSoderquist, JDellaria, JFStein, HCohen, JPerun, TJGreer, JPlattner, JJ New inhibitors of human renin that contain novel Leu-Val replacements. Examination of the P1 site. J Med Chem 31:532-9 (1988)  
Target
Name:
Renin
Synonyms:
Angiotensinogenase RENI_HUMAN
Type:
Enzyme
Mol. Mass.:
45058.99
Organism:
Homo sapiens (Human)
Description:
Residue:
406
  
Inhibitor
Name:
BDBM50022875
Synonyms:
1N-[1-[3-cyclohexyl-1-formyl-(1S)-propylcarbamoyl]-(1S)-ethyl]-2-aminotertiarybutyloxycarbonyl-3-phenyl-(2S)-propanamide | CHEMBL151836
Type:
Small organic molecule
Emp. Form.:
C27H41N3O5
Mol. Mass.:
487.6315
SMILES:
C[C@H](NC(=O)[C@H](Cc1ccccc1)NC(=O)OC(C)(C)C)C(=O)N[C@@H](CCC1CCCCC1)C=O
: