Target
Renin
Ligand
BDBM50022978
Substrate
Meas. Tech.
ChEMBL_157426 (CHEMBL768881)
IC50
81±n/a nM
Citation
 Hui, KYCarlson, WDBernatowicz, MSHaber, E Analysis of structure-activity relationships in renin substrate analogue inhibitory peptides. J Med Chem 30:1287-95 (1987)  
Target
Name:
Renin
Synonyms:
Angiotensinogenase RENI_HUMAN
Type:
Enzyme
Mol. Mass.:
45058.99
Organism:
Homo sapiens (Human)
Description:
Residue:
406
  
Inhibitor
Name:
BDBM50022978
Synonyms:
CHEMBL264339 | Pro-His-Pro-Phe-His-Statine-Ile-Phe-NH2
Type:
Small organic molecule
Emp. Form.:
C54H75N13O9
Mol. Mass.:
1050.255
SMILES:
CC[C@H](C)[C@H](NC(=O)CC(O)C(CC(C)C)NC(=O)[C@H](Cc1cnc[nH]1)NC(=O)[C@H](Cc1ccccc1)NC(=O)[C@@H]1CCCN1C(=O)[C@H](Cc1cnc[nH]1)NC(=O)[C@@H]1CCCN1)C(=O)NC(=O)[C@@H](N)Cc1ccccc1
: