Target
Renin
Ligand
BDBM50022973
Substrate
Meas. Tech.
ChEBML_154903
IC50
100000±n/a nM
Citation
 Hui, KYCarlson, WDBernatowicz, MSHaber, E Analysis of structure-activity relationships in renin substrate analogue inhibitory peptides. J Med Chem 30:1287-95 (1987)  
Target
Name:
Renin
Synonyms:
Angiotensinogenase RENI_HUMAN
Type:
Enzyme
Mol. Mass.:
45058.99
Organism:
Homo sapiens (Human)
Description:
Residue:
406
  
Inhibitor
Name:
BDBM50022973
Synonyms:
CHEMBL2371819 | Pro-Phe-His-delta-ornithine-Val-Tyr-Lys-NH2
Type:
Small organic molecule
Emp. Form.:
C45H66N12O8
Mol. Mass.:
903.0811
SMILES:
CC(C)[C@H](NC(=O)[C@H](CCCN)NC(=O)[C@H](Cc1c[nH]cn1)NC(=O)[C@H](Cc1ccccc1)NC(=O)[C@@H]1CCCN1)C(=O)N[C@@H](Cc1ccc(O)cc1)C(=O)N[C@@H](CCCCN)C(N)=O
: