Target
Renin
Ligand
BDBM50023022
Substrate
Meas. Tech.
ChEBML_196099
IC50
960.0±n/a nM
Citation
 Luly, JRYi, NSoderquist, JStein, HCohen, JPerun, TJPlattner, JJ New inhibitors of human renin that contain novel Leu-Val replacements. J Med Chem 30:1609-16 (1987)  
Target
Name:
Renin
Synonyms:
Angiotensinogenase RENI_HUMAN
Type:
Enzyme
Mol. Mass.:
45058.99
Organism:
Homo sapiens (Human)
Description:
Residue:
406
  
Inhibitor
Name:
BDBM50023022
Synonyms:
CHEMBL3144117 | {1-[1-[1-(1-Hydroxy-2-phenylsulfanyl-ethyl)-3-methyl-butylcarbamoyl]-2-(1H-imidazol-4-yl)-ethylcarbamoyl]-2-phenyl-ethyl}-carbamic acid tert-butyl ester
Type:
Small organic molecule
Emp. Form.:
C33H45N5O5S
Mol. Mass.:
623.806
SMILES:
CC(C)C[C@@H](NC(=O)[C@H](Cc1c[nH]cn1)NC(=O)[C@H](Cc1ccccc1)NC(=O)OC(C)(C)C)[C@H](O)CSc1ccccc1
: