Target
Renin
Ligand
BDBM50023045
Substrate
Meas. Tech.
ChEBML_196099
IC50
90±n/a nM
Citation
 Luly, JRYi, NSoderquist, JStein, HCohen, JPerun, TJPlattner, JJ New inhibitors of human renin that contain novel Leu-Val replacements. J Med Chem 30:1609-16 (1987)  
Target
Name:
Renin
Synonyms:
Angiotensinogenase RENI_HUMAN
Type:
Enzyme
Mol. Mass.:
45058.99
Organism:
Homo sapiens (Human)
Description:
Residue:
406
  
Inhibitor
Name:
BDBM50023045
Synonyms:
CHEMBL3144147 | {1-[1-[1-(2-Cyclohexanesulfonyl-1-hydroxy-ethyl)-3-methyl-butylcarbamoyl]-2-(1H-imidazol-4-yl)-ethylcarbamoyl]-2-phenyl-ethyl}-carbamic acid tert-butyl ester
Type:
Small organic molecule
Emp. Form.:
C33H51N5O7S
Mol. Mass.:
661.852
SMILES:
CC(C)C[C@@H](NC(=O)[C@H](Cc1c[nH]cn1)NC(=O)[C@H](Cc1ccccc1)NC(=O)OC(C)(C)C)[C@H](O)CS(=O)(=O)C1CCCCC1
: