Target
Renin
Ligand
BDBM50023087
Substrate
Meas. Tech.
ChEMBL_196264 (CHEMBL803241)
Ki
36±n/a nM
Citation
 Bock, MGDiPardo, RMEvans, BERittle, KEBoger, JPoe, MLaMont, BILynch, RJUlm, EHVlasuk, GP Renin inhibitors. Statine-containing tetrapeptides with varied hydrophobic carboxy termini. J Med Chem 30:1853-7 (1987)  
Target
Name:
Renin
Synonyms:
Angiotensinogenase RENI_HUMAN
Type:
Enzyme
Mol. Mass.:
45058.99
Organism:
Homo sapiens (Human)
Description:
Residue:
406
  
Inhibitor
Name:
BDBM50023087
Synonyms:
Boc-Phe-His-Sta-Leu-Phe-NH2 CHEMBL53099
Type:
Small organic molecule
Emp. Form.:
C43H62N8O8
Mol. Mass.:
819.0012
SMILES:
CC(C)CC(NC(=O)[C@H](Cc1cnc[nH]1)NC(=O)[C@H](Cc1ccccc1)NC(=O)OC(C)(C)C)C(O)CC(=O)N[C@@H](CC(C)C)C(=O)N[C@@H](Cc1ccccc1)C(N)=O
: