Target
Renin
Ligand
BDBM50023094
Substrate
Meas. Tech.
ChEMBL_196265 (CHEMBL803242)
Ki
0.200±n/a nM
Citation
 Bock, MGDiPardo, RMEvans, BERittle, KEBoger, JPoe, MLaMont, BILynch, RJUlm, EHVlasuk, GP Renin inhibitors. Statine-containing tetrapeptides with varied hydrophobic carboxy termini. J Med Chem 30:1853-7 (1987)  
Target
Name:
Renin
Synonyms:
Angiotensinogenase RENI_HUMAN
Type:
Enzyme
Mol. Mass.:
45058.99
Organism:
Homo sapiens (Human)
Description:
Residue:
406
  
Inhibitor
Name:
BDBM50023094
Synonyms:
Boc-Phe-His-Sta-Leu-erythro-1,2-diphenyl-2-hydroxy-ethylamide | CHEMBL300498
Type:
Small organic molecule
Emp. Form.:
C48H65N7O8
Mol. Mass.:
868.0718
SMILES:
CC(C)CC(NC(=O)[C@H](Cc1cnc[nH]1)NC(=O)[C@H](Cc1ccccc1)NC(=O)OC(C)(C)C)C(O)CC(=O)N[C@@H](CC(C)C)C(=O)NC(C(O)c1ccccc1)c1ccccc1
: