Target
Acetylcholine receptor subunit alpha/beta/delta/gamma
Ligand
BDBM50023328
Substrate
Meas. Tech.
ChEMBL_143081 (CHEMBL748731)
IC50
300±n/a nM
Citation
 Kanne, DBAbood, LG Synthesis and biological characterization of pyridohomotropanes. Structure-activity relationships of conformationally restricted nicotinoids. J Med Chem 31:506-9 (1988)  
Target
Name:
Acetylcholine receptor subunit alpha/beta/delta/gamma
Synonyms:
Acetylcholine receptor | Acetylcholine receptor protein alpha/beta/delta/gamma chain
Type:
Mol. Mass.:
Description:
ASSAY_ID of EBI is 143080
Components:
This complex has 4 components.
Component 1
Name:
Acetylcholine receptor subunit beta
Synonyms:
ACHB_TETCF CHRNB1
Type:
PROTEIN
Mol. Mass.:
56146.98
Organism:
Torpedo californica
Description:
EBI_19626
Residue:
493
  
Component 2
Name:
Acetylcholine receptor subunit gamma
Synonyms:
ACHG_TETCF CHRNG
Type:
PROTEIN
Mol. Mass.:
58151.68
Organism:
Torpedo californica
Description:
EBI_19662
Residue:
506
  
Component 3
Name:
Acetylcholine receptor subunit alpha
Synonyms:
ACHA_TETCF Acetylcholine receptor protein alpha chain | CHRNA1
Type:
PROTEIN
Mol. Mass.:
52735.09
Organism:
Torpedo californica
Description:
ChEMBL_216981
Residue:
461
  
Component 4
Name:
Acetylcholine receptor subunit delta
Synonyms:
ACHD_TETCF Acetylcholine receptor protein delta chain | chrnd
Type:
PROTEIN
Mol. Mass.:
59885.01
Organism:
Torpedo californica
Description:
ChEMBL_142744
Residue:
522
  
Inhibitor
Name:
BDBM50023328
Synonyms:
3-Pyrrolidin-2-yl-pyridine Nornicotine | US10667515, Compound nornicotine
Type:
Small organic molecule
Emp. Form.:
C9H12N2
Mol. Mass.:
148.205
SMILES:
C1CNC(C1)c1cccnc1
: