Target
Nuclear receptor ROR-beta
Ligand
BDBM50460733
Substrate
Meas. Tech.
ChEMBL_1770184 (CHEMBL4222296)
IC50
140±n/a nM
Citation
 Patouret, RDoebelin, CGarcia-Ordonez, RDChang, MRRuiz, CCameron, MDGriffin, PRKamenecka, TM Identification of an aminothiazole series of ROR? modulators. Bioorg Med Chem Lett 28:1178-1181 (2018)  
Target
Name:
Nuclear receptor ROR-beta
Synonyms:
NR1F2 Nuclear receptor subfamily 1 group F member 2 RORB_HUMAN Retinoid-related orphan receptor-beta
Type:
PROTEIN
Mol. Mass.:
53227.30
Organism:
Homo sapiens (Human)
Description:
ChEMBL_107979
Residue:
470
  
Inhibitor
Name:
BDBM50460733
Synonyms:
CHEMBL4227927
Type:
Small organic molecule
Emp. Form.:
C17H9Cl2F3N2OS
Mol. Mass.:
417.232
SMILES:
Nc1nc(c(s1)C(=O)c1ccccc1Cl)-c1cc(Cl)cc(c1)C(F)(F)F
: