Target
Adenosine receptor A1
Ligand
BDBM50023493
Substrate
Meas. Tech.
ChEBML_28547
IC50
61±n/a nM
Citation
 Francis, JECash, WDPsychoyos, SGhai, GWenk, PFriedmann, RCAtkins, CWarren, VFurness, PHyun, JL Structure-activity profile of a series of novel triazoloquinazoline adenosine antagonists. J Med Chem 31:1014-20 (1988)  
Target
Name:
Adenosine receptor A1
Synonyms:
AA1R_RAT ADENOSINE A1 high Adenosine A1 receptor (A1) Adenosine receptors A1 | Adora1
Type:
Protein
Mol. Mass.:
36704.13
Organism:
Rattus norvegicus (rat)
Description:
Residue:
326
  
Inhibitor
Name:
BDBM50023493
Synonyms:
CHEMBL266267 | sec-Butyl-(9-chloro-2-furan-2-yl-[1,2,4]triazolo[1,5-c]quinazolin-5-yl)-amine; compound with methanesulfonic acid
Type:
Small organic molecule
Emp. Form.:
C17H16ClN5O
Mol. Mass.:
341.795
SMILES:
CCC(C)Nc1nc2ccc(Cl)cc2c2nc(nn12)-c1ccco1
: