Target
Cathepsin B
Ligand
BDBM50461248
Substrate
Meas. Tech.
ChEMBL_1771109 (CHEMBL4223221)
IC50
1721±n/a nM
Citation
 Nizi, ESferrazza, AFabbrini, DNardi, VAndreini, MGraziani, RGennari, NBresciani, APaonessa, GHarper, S Peptidomimetic nitrile inhibitors of malarial protease falcipain-2 with high selectivity against human cathepsins. Bioorg Med Chem Lett 28:1540-1544 (2018)  
Target
Name:
Cathepsin B
Synonyms:
APP secretase CATB_HUMAN CTSB Cathepsin B light chain | Cathepsin B1
Type:
Enzyme
Mol. Mass.:
37819.69
Organism:
Homo sapiens (Human)
Description:
gi_63102437
Residue:
339
  
Inhibitor
Name:
BDBM50461248
Synonyms:
CHEMBL4227295
Type:
Small organic molecule
Emp. Form.:
C23H25N3O2
Mol. Mass.:
375.4635
SMILES:
CC(C)C[C@H](NC(=O)c1ccc(cc1)-c1ccccc1)C(=O)NC1(CC1)C#N
: