Target
Serine/threonine-protein kinase B-raf
Ligand
BDBM16673
Substrate
Meas. Tech.
ChEMBL_1771288 (CHEMBL4223400)
IC50
24±n/a nM
Citation
 Sun, SHe, ZHuang, MWang, NHe, ZKong, XYao, J Design and discovery of thioether and nicotinamide containing sorafenib analogues as multikinase inhibitors targeting B-Raf, B-Raf Bioorg Med Chem 26:2381-2391 (2018)  
Target
Name:
Serine/threonine-protein kinase B-raf
Synonyms:
B-RAF B-Raf proto-oncogene serine/threonine-protein kinase BRAF1 RAFB1 v-Raf murine sarcoma viral oncogene homolog B1
Type:
Serine/threonine-protein kinase
Mol. Mass.:
84446.00
Organism:
Homo sapiens (Human)
Description:
P15056
Residue:
766
  
Inhibitor
Name:
BDBM16673
Synonyms:
4-[4-({[4-chloro-3-(trifluoromethyl)phenyl]carbamoyl}amino)phenoxy]-N-methylpyridine-2-carboxamide BAY 43-9006 BAY439006 Hit compound, 8 Sorafenib US10183928, Sorafenib US10227329, Compound Sorafenib US10774070, Compound Sorafenib US11279688, Compound Sorafenib US9029401, Sorafenib US9902709, Comparative example 1 cid_216239
Type:
Small organic molecule
Emp. Form.:
C21H16ClF3N4O3
Mol. Mass.:
464.825
SMILES:
CNC(=O)c1cc(Oc2ccc(NC(=O)Nc3ccc(Cl)c(c3)C(F)(F)F)cc2)ccn1
: