Target
Genome polyprotein/Non-structural protein 4A
Ligand
BDBM50461537
Substrate
Meas. Tech.
ChEMBL_1771452 (CHEMBL4223564)
IC50
0.240000±n/a nM
Citation
 Venables, BLSin, NWang, AXSun, LQTu, YHernandez, DSheaffer, ALee, MDunaj, CZhai, GBarry, DFriborg, JYu, FKnipe, JSandquist, JFalk, PParker, DGood, ACRajamani, RMcPhee, FMeanwell, NAScola, PM P3-P4 ureas and reverse carbamates as potent HCV NS3 protease inhibitors: Effective transposition of the P4 hydrogen bond donor. Bioorg Med Chem Lett 28:1853-1859 (2018)  
Target
Name:
Genome polyprotein/Non-structural protein 4A
Synonyms:
Hepatitis C virus serine protease, NS3/NS4A
Type:
Mol. Mass.:
Description:
ASSAY_ID of ChEMBL is 1969955
Components:
This complex has 2 components.
Component 1
Name:
Non-structural protein 4A
Synonyms:
Hepatitis C virus NS4A protein Non-structural protein 4A
Type:
PROTEIN
Mol. Mass.:
5762.65
Organism:
Hepatitis C virus
Description:
ChEMBL_305334
Residue:
54
  
Component 2
Name:
Genome polyprotein
Synonyms:
Hepatitis C virus NS3 protease/helicase | Hepatitis C virus serine protease, NS3/NS4A
Type:
Protein
Mol. Mass.:
67067.41
Organism:
Hepatitis C virus
Description:
A3EZI9
Residue:
631
  
Inhibitor
Name:
BDBM50461537
Synonyms:
CHEMBL4228440
Type:
Small organic molecule
Emp. Form.:
C37H51N7O9S
Mol. Mass.:
769.907
SMILES:
COc1ccc2c(O[C@@H]3C[C@H](N(C3)C(=O)[C@@H](NC(=O)N[C@H](C(N)=O)C(C)(C)C)C(C)(C)C)C(=O)N[C@@]3(C[C@H]3C=C)C(=O)NS(=O)(=O)C3CC3)nccc2c1
: