Target
Dihydrofolate reductase
Ligand
BDBM66082
Substrate
Meas. Tech.
ChEMBL_217876 (CHEMBL821982)
Ki
0.000±n/a nM
Citation
 Su, TLHuang, JTChou, TCOtter, GMSirotnak, FMWatanabe, KA Chemical synthesis and biological activities of 5-deazaaminopterin analogues bearing substituent(s) at the 5- and/or 7-position(s). J Med Chem 31:1209-15 (1988)  
Target
Name:
Dihydrofolate reductase
Synonyms:
DYR_MOUSE | Dhfr
Type:
Enzyme
Mol. Mass.:
21608.82
Organism:
Mus musculus (Mouse)
Description:
Residue:
187
  
Inhibitor
Name:
BDBM66082
Synonyms:
(2S)-2-[[4-[(2,4-diaminopteridin-6-yl)methyl-methyl-amino]benzoyl]amino]glutaric acid;hydrate (2S)-2-[[4-[[2,4-bis(azanyl)pteridin-6-yl]methyl-methyl-amino]phenyl]carbonylamino]pentanedioic acid;hydrate L-Glutamic acid, N-[4-[[(2,4-diamino-6-pteridinyl)methyl]methylamino]benzoyl]- [CAS] SMR000449324 cid_165528
Type:
Small organic molecule
Emp. Form.:
C20H22N8O5
Mol. Mass.:
454.4393
SMILES:
CN(Cc1cnc2nc(N)nc(N)c2n1)c1ccc(cc1)C(=O)N[C@@H](CCC(O)=O)C(O)=O
: