Target
D(2) dopamine receptor
Ligand
BDBM84636
Substrate
Meas. Tech.
ChEBML_62100
Ki
2.7±n/a nM
Citation
 Gao, YZong, RCampbell, AKula, NSBaldessarini, RJNeumeyer, JL Synthesis and dopamine agonist and antagonist effects of (R)-(-)- and (S)-(+)-11-hydroxy-N-n-propylnoraporphine. J Med Chem 31:1392-6 (1988)  
Target
Name:
D(2) dopamine receptor
Synonyms:
DOPAMINE D2 DOPAMINE D2 Short Dopamine D2 receptor Drd2
Type:
G Protein-Coupled Receptor (GPCR)
Mol. Mass.:
50931.60
Organism:
Rattus norvegicus (rat)
Description:
P61169
Residue:
444
  
Inhibitor
Name:
BDBM84636
Synonyms:
CHEMBL27559 | NPA-11-OH-R,(+)
Type:
Small organic molecule
Emp. Form.:
C19H21NO
Mol. Mass.:
279.3761
SMILES:
CCCN1CCc2cccc-3c2[C@H]1Cc1cccc(O)c-31
: