Target
Receptor tyrosine-protein kinase erbB-2
Ligand
BDBM50462407
Substrate
Meas. Tech.
ChEMBL_1775326 (CHEMBL4232318)
IC50
60±n/a nM
Citation
 Choudhary, SSingh, PKVerma, HSingh, HSilakari, O Success stories of natural product-based hybrid molecules for multi-factorial diseases. Eur J Med Chem 151:62-97 (2018)  
Target
Name:
Receptor tyrosine-protein kinase erbB-2
Synonyms:
2.7.10.1 CD_antigen=CD340 ERBB2_HUMAN FASN/HER2 HER2 MLN19 NEU Proto-oncogene Neu Tyrosine kinase-type cell surface receptor HER2 | p185erbB2
Type:
Mol. Mass.:
137894.47
Organism:
Homo sapiens (Human)
Description:
P04626
Residue:
1255
  
Inhibitor
Name:
BDBM50462407
Synonyms:
CHEMBL4250540
Type:
Small organic molecule
Emp. Form.:
C60H84N6O16
Mol. Mass.:
1145.3396
SMILES:
CO[C@H]1C[C@H](C)CC2=C(NCCCCNC3=C4C[C@@H](C)C[C@H](OC)[C@H](O)[C@@H](C)\C=C(C)\[C@H](OC(N)=O)[C@@H](OC)\C=C/C=C(C)/C(=O)NC(=CC3=O)C4=O)C(=O)C=C(NC(=O)\C(C)=C\C=C/[C@H](OC)[C@@H](OC(N)=O)\C(C)=C\[C@H](C)[C@H]1O)C2=O
: