Target
Sterol O-acyltransferase 1
Ligand
BDBM50462651
Substrate
Meas. Tech.
ChEMBL_1776184 (CHEMBL4233176)
IC50
900±n/a nM
Citation
 Shibuya, KKawamine, KMiura, TOzaki, CEdano, TMizuno, KYoshinaka, YTsunenari, Y Design, synthesis and pharmacology of aortic-selective acyl-CoA: Cholesterol O-acyltransferase (ACAT/SOAT) inhibitors. Bioorg Med Chem 26:4001-4013 (2018)  
Target
Name:
Sterol O-acyltransferase 1
Synonyms:
ACAT-1 Acetoacetyl-CoA thiolase Acyl coenzyme A:cholesterol acyltransferase 1 Cholesterol acyltransferase 1 Soat1 | Sterol O-acyltransferase 1
Type:
PROTEIN
Mol. Mass.:
63818.83
Organism:
Mus musculus
Description:
ChEMBL_90523
Residue:
540
  
Inhibitor
Name:
BDBM50462651
Synonyms:
CHEMBL4250140
Type:
Small organic molecule
Emp. Form.:
C27H34N2O4S
Mol. Mass.:
482.635
SMILES:
COC(=O)c1cccc2oc(SCCCCCC(=O)Nc3c(cccc3C(C)C)C(C)C)nc12
: