Target
Rho-associated protein kinase 1
Ligand
BDBM50462718
Substrate
Meas. Tech.
ChEMBL_1776286 (CHEMBL4233278)
Ki
10.0±n/a nM
Citation
 Gao, HMarhefka, CJacobs, MDCao, JBandarage, UKGreen, J ROCK inhibitors 2. Improving potency, selectivity and solubility through the application of rationally designed solubilizing groups. Bioorg Med Chem Lett 28:2616-2621 (2018)  
Target
Name:
Rho-associated protein kinase 1
Synonyms:
ROCK-I ROCK1_HUMAN Rho-associated protein kinase Rho-associated, coiled-coil-containing protein kinase 1 Rho-kinase (ROCK I) p160 ROCK-1 | p160ROCK
Type:
Serine/threonine-protein kinase
Mol. Mass.:
158156.77
Organism:
Homo sapiens (Human)
Description:
Q13464
Residue:
1354
  
Inhibitor
Name:
BDBM50462718
Synonyms:
CHEMBL4237479
Type:
Small organic molecule
Emp. Form.:
C25H30N4O2S
Mol. Mass.:
450.596
SMILES:
CN1CCC(CCCOc2cccc(CC(=O)Nc3nc(cs3)-c3ccncc3)c2)CC1
: