Target
Free fatty acid receptor 4
Ligand
BDBM22496
Substrate
Meas. Tech.
ChEMBL_1776556 (CHEMBL4233548)
EC50
3500±n/a nM
Citation
 Sheng, RYang, LZhang, YXing, EShi, RWen, XWang, HSun, H Discovery of novel selective GPR120 agonists with potent anti-diabetic activity by hybrid design. Bioorg Med Chem Lett 28:2599-2604 (2018)  
Target
Name:
Free fatty acid receptor 4
Synonyms:
FFAR4 G-protein coupled receptor 120 G-protein coupled receptor GT01 GPR120 O3FAR1 PGR4
Type:
PROTEIN
Mol. Mass.:
42256.91
Organism:
Homo sapiens (Human)
Description:
ChEMBL_1508994
Residue:
377
  
Inhibitor
Name:
BDBM22496
Synonyms:
3-(4-{[(3-phenoxyphenyl)methyl]amino}phenyl)propanoic acid carboxylic acid agonist, 2
Type:
Small organic molecule
Emp. Form.:
C22H21NO3
Mol. Mass.:
347.407
SMILES:
OC(=O)CCc1ccc(NCc2cccc(Oc3ccccc3)c2)cc1
: