Target
Gastrin/cholecystokinin type B receptor
Ligand
BDBM50024327
Substrate
Meas. Tech.
ChEBML_71525
IC50
1200±n/a nM
Citation
 Rodriguez, MDubreuil, PBali, JPMartinez, J Synthesis and biological activity of partially modified retro-inverso pseudopeptide derivatives of the C-terminal tetrapeptide of gastrin. J Med Chem 30:758-63 (1987)  
Target
Name:
Gastrin/cholecystokinin type B receptor
Synonyms:
CCK-2 receptor CCK-BR CCKRB Cholecystokinin receptor GASR_HUMAN | Gastrin/cholecystokinin type B receptor
Type:
G Protein-Coupled Receptor (GPCR)
Mol. Mass.:
48445.79
Organism:
Homo sapiens (Human)
Description:
Stable expression of human CCK-2 receptors in HEK 293 cells.
Residue:
447
  
Inhibitor
Name:
BDBM50024327
Synonyms:
CHEMBL349888 | N-{1-[2-tert-Butoxycarbonylamino-3-(1H-indol-3-yl)-propionylamino]-3-methyl-butyl}-3-(2-carbamoyl-3-phenyl-propionylamino)-succinamic acid
Type:
Small organic molecule
Emp. Form.:
C35H46N6O8
Mol. Mass.:
678.7751
SMILES:
CC(C)C[C@@H](NC(=O)[C@H](CC(O)=O)NC(=O)C(Cc1ccccc1)C(N)=O)NC(=O)[C@@H](Cc1c[nH]c2ccccc12)NC(=O)OC(C)(C)C
: