Target
Gastrin/cholecystokinin type B receptor
Ligand
BDBM50024332
Substrate
Meas. Tech.
ChEBML_71525
IC50
6000±n/a nM
Citation
 Rodriguez, MDubreuil, PBali, JPMartinez, J Synthesis and biological activity of partially modified retro-inverso pseudopeptide derivatives of the C-terminal tetrapeptide of gastrin. J Med Chem 30:758-63 (1987)  
Target
Name:
Gastrin/cholecystokinin type B receptor
Synonyms:
CCK-2 receptor CCK-BR CCKRB Cholecystokinin receptor GASR_HUMAN | Gastrin/cholecystokinin type B receptor
Type:
G Protein-Coupled Receptor (GPCR)
Mol. Mass.:
48445.79
Organism:
Homo sapiens (Human)
Description:
Stable expression of human CCK-2 receptors in HEK 293 cells.
Residue:
447
  
Inhibitor
Name:
BDBM50024332
Synonyms:
3-{2-[2-tert-Butoxycarbonylamino-3-(1H-indol-3-yl)-propionylamino]-4-methyl-pentanoylamino}-3-(3-phenyl-propionylamino)-propionic acid | CHEMBL351506
Type:
Small organic molecule
Emp. Form.:
C34H45N5O7
Mol. Mass.:
635.7504
SMILES:
CC(C)C[C@H](NC(=O)[C@@H](Cc1c[nH]c2ccccc12)NC(=O)OC(C)(C)C)C(=O)N[C@H](CC(O)=O)NC(=O)CCc1ccccc1
: