Target
Gastrin/cholecystokinin type B receptor
Ligand
BDBM50024333
Substrate
Meas. Tech.
ChEBML_71525
IC50
81000±n/a nM
Citation
 Rodriguez, MDubreuil, PBali, JPMartinez, J Synthesis and biological activity of partially modified retro-inverso pseudopeptide derivatives of the C-terminal tetrapeptide of gastrin. J Med Chem 30:758-63 (1987)  
Target
Name:
Gastrin/cholecystokinin type B receptor
Synonyms:
CCK-2 receptor CCK-BR CCKRB Cholecystokinin receptor GASR_HUMAN | Gastrin/cholecystokinin type B receptor
Type:
G Protein-Coupled Receptor (GPCR)
Mol. Mass.:
48445.79
Organism:
Homo sapiens (Human)
Description:
Stable expression of human CCK-2 receptors in HEK 293 cells.
Residue:
447
  
Inhibitor
Name:
BDBM50024333
Synonyms:
CHEMBL351531 | N-{1-[1-(2-Butoxycarbonyl-ethylcarbamoyl)-2-(1H-indol-3-yl)-ethylcarbamoyl]-pentyl}-3-(3-phenyl-propionylamino)-succinamic acid
Type:
Small organic molecule
Emp. Form.:
C37H49N5O8
Mol. Mass.:
691.8137
SMILES:
CCCCOC(=O)CCNC(=O)[C@H](Cc1c[nH]c2ccccc12)NC(=O)[C@@H](CCCC)NC(=O)[C@H](CC(O)=O)NC(=O)CCc1ccccc1
: