Target
Gastrin/cholecystokinin type B receptor
Ligand
BDBM50024335
Substrate
Meas. Tech.
ChEBML_71525
IC50
15000±n/a nM
Citation
 Rodriguez, MDubreuil, PBali, JPMartinez, J Synthesis and biological activity of partially modified retro-inverso pseudopeptide derivatives of the C-terminal tetrapeptide of gastrin. J Med Chem 30:758-63 (1987)  
Target
Name:
Gastrin/cholecystokinin type B receptor
Synonyms:
CCK-2 receptor CCK-BR CCKRB Cholecystokinin receptor GASR_HUMAN | Gastrin/cholecystokinin type B receptor
Type:
G Protein-Coupled Receptor (GPCR)
Mol. Mass.:
48445.79
Organism:
Homo sapiens (Human)
Description:
Stable expression of human CCK-2 receptors in HEK 293 cells.
Residue:
447
  
Inhibitor
Name:
BDBM50024335
Synonyms:
3-(3-Benzyl-ureido)-N-{1-[2-tert-butoxycarbonylamino-3-(1H-indol-3-yl)-propionylamino]-pentyl}-succinamic acid | CHEMBL351313
Type:
Small organic molecule
Emp. Form.:
C33H44N6O7
Mol. Mass.:
636.7385
SMILES:
CCCC[C@@H](NC(=O)[C@H](CC(O)=O)NC(=O)NCc1ccccc1)NC(=O)[C@@H](Cc1c[nH]c2ccccc12)NC(=O)OC(C)(C)C
: