Target
Large neutral amino acids transporter small subunit 1
Ligand
BDBM60928
Substrate
Meas. Tech.
ChEMBL_1778012 (CHEMBL4235004)
IC50
100000±n/a nM
Citation
 Thiele, NAKärkkäinen, JSloan, KBRautio, JHuttunen, KM Secondary carbamate linker can facilitate the sustained release of dopamine from brain-targeted prodrug. Bioorg Med Chem Lett 28:2856-2860 (2018)  
Target
Name:
Large neutral amino acids transporter small subunit 1
Synonyms:
4F2 LC 4F2LC CD98LC Integral membrane protein E16 LAT1 Large neutral amino acids transporter small subunit 1 SLC7A5 hLAT1 | y+ system cationic amino acid transporter
Type:
PROTEIN
Mol. Mass.:
55013.61
Organism:
Homo sapiens (Human)
Description:
ChEMBL_100160
Residue:
507
  
Inhibitor
Name:
BDBM60928
Synonyms:
BDBM50130192 L-DOPA dihydroxyphenylalanine
Type:
Emp. Form.:
C9H11NO4
Mol. Mass.:
197.1879
SMILES:
N[C@@H](Cc1ccc(O)c(O)c1)C(O)=O
: